您的位置:威尼斯官方网站 > 威尼斯官方网站 >     编译和装置

    编译和装置

发布时间:2019-08-26 20:08编辑:威尼斯官方网站浏览(63)

    Linux下编译,安装Apache httpd服务器,apachehttpd

      环境:ubuntu 16.0.4

      Apache官网下载Apache httpd压缩包:httpd-2.4.27.tar.gz,安装之前请确定安装了make工具,我安装的是GNU make

        安装 APR(其实不用安装,后面说明):下载 apr-1.6.2.tar.gz

        解压:

    sudo tar -zxvf '/home/fanchao/桌面/share/apache http server/apr-1.6.2.tar.gz' -C /etc/httpd
    

         编译和安装:

    sudo
    cd /etc/httpd/apr-1.6.2 #进入解压后的文件目录
    sudo ./configure #这里可以添加参数 --prefix=你要安装的目录,我这里没有加,默认安装在/user/loacl目录下 以下所有的./configure都可以添加这个参数
    sudo make
    sudo make install
    

        安装APR-UTIL(其实不用安装,后面说明):下载 apr-util-1.6.0.tar.gz

        解压:

    sudo tar -zxvf '/home/fanchao/ 桌面/share/apache http server/apr-util-1.6.0.tar.gz'  -C /etc/httpd
    

        编译和安装

    cd /etc/httpd/apr-util-1.6.0
    sudo ./configure --with-apr=/usr/local/apr/bin/apr-1-config
    sudo make
    

        这里报错

    xml/apr_xml.c:35:19: fatal error: expat.h: 没有那个文件或目录
    compilation terminated.
    /etc/httpd/apr-util-1.6.0/build/rules.mk:206: recipe for target 'xml/apr_xml.lo' failed
    make[1]: *** [xml/apr_xml.lo] Error 1
    make[1]: Leaving directory '/etc/httpd/apr-util-1.6.0'
    /etc/httpd/apr-util-1.6.0/build/rules.mk:118: recipe for target 'all-recursive' failed
    make: *** [all-recursive] Error 1
    

        解决办法就是安装libexpat1-dev

    sudo apt-get install libexpat1-dev
    

        重新输

    sudo make
    sudo make install
    

         安装httpd所需要的prce库:下载prce-8.41.zip

         解压:

    sudo unzip   '/home/fanchao/桌面/share/apache http server/pcre-8.41.zip' -d /etc/httpd
    

        编译和安装:

    cd /etc/httpd/pcre-8.41
    sudo ./configure
    sudo make 
    sudo make install
    

        最后编译安装apache httpd

    sudo ./configure --with-apr='/usr/local/apr/bin/apr-1-config' --with-apr-util='/usr/local/apr/bin/apu-1-config' --with-prce='/usr/local/bin/pcre-config' #这里还有其他参数可以配置,具体参照官方
    sudo make
    sudo make install
    

        到现在按照官方文档的说明应该就已经安装好了,但是我到make这步就报错了

    collect2: error: ld returned 1 exit status
    Makefile:48: recipe for target 'htpasswd' failed
    make[2]: *** [htpasswd] Error 1
    make[2]: Leaving directory '/etc/httpd-2.4.27/support'
    /etc/httpd-2.4.27/build/rules.mk:75: recipe for target 'all-recursive' failed
    make[1]: *** [all-recursive] Error 1
    make[1]: Leaving directory '/etc/httpd-2.4.27/support'
    /etc/httpd-2.4.27/build/rules.mk:75: recipe for target 'all-recursive' failed
    make: *** [all-recursive] Error 1
    

        我查了很多地方都没有遇到这个错误或者说这个错误是怎么发生的。这个错误是因为在httpd目录下的srclib目录里面没有apr和apr-util所导致的,但是./configure又不会报错,到make才会报错,所以把下载下来到apr和apr-util解压到srclib目录下到apr和apr-util目录,注意目录名字要一致。

        这就是我之前说的不用安装apr和apr-util的原因,它会自动安装,手动安装后去指定安装路径是会报错的。

        重新生成make文件和make

     sudo ./configure  --with-prce='/usr/local/bin/pcre-config' --with-included-apr #其他参数请参照官方
    sudo make
    sudo make install
    

        现在就可以安装成功了,如果没有指定文件夹那么就会默认安装在 /usr/local/apache2

        运行

    sudo '/usr/local/apache2/bin/apachectl' -k start #启动
    sudo '/usr/local/apache2/bin/apachectl' -k stop #停止
    

        完结。

     

     

        

    httpd服务器,apachehttpd 环境:ubuntu 16.0.4 Apache官网下载Apache httpd压缩包:httpd-2.4.27.tar.gz,安装之前请确定安装了make工...

    本文由威尼斯官方网站发布于威尼斯官方网站,转载请注明出处:    编译和装置

    关键词: